BDBM50390331 CHEMBL2070731
SMILES Nc1nc(nc2n(CC3CN(Cc4ccccc4)CCO3)nnc12)C1CC1
InChI Key InChIKey=XBEROKDSRKZRKO-UHFFFAOYSA-N
Data  1 IC50
  Tab Delimited (TSV)   2D SDfile   Computed 3D by Vconf -m prep SDfile
Find this compound or compounds like it in BindingDB:
Activity Spreadsheet -- Enzyme Inhibition Constant Data from BindingDB
Found 1 hit for monomerid = 50390331
LigandPNGBDBM50390331(CHEMBL2070731)
Affinity DataIC50:  41nM. Assay description: Inhibition of PDE8B expressed in Sf9 insect cells
In DepthDetails ArticlePubMed