BDBM50390347 CHEMBL2070896
SMILES Nc1nc(CC2CC2)nc2n(CC3CCCCO3)nnc12
InChI Key InChIKey=MLTJKBZTDDZGAI-UHFFFAOYSA-N
Data  1 IC50
  Tab Delimited (TSV)   2D SDfile   Computed 3D by Vconf -m prep SDfile
Find this compound or compounds like it in BindingDB:
Activity Spreadsheet -- Enzyme Inhibition Constant Data from BindingDB
Found 1 hit for monomerid = 50390347
LigandPNGBDBM50390347(CHEMBL2070896)
Affinity DataIC50:  319nM. Assay description: Inhibition of PDE8B expressed in Sf9 insect cells
In DepthDetails ArticlePubMed