BDBM50390359 CHEMBL2070928
SMILES Cc1ccn2cc(Cn3nnc4c(N)nc(nc34)C3CC3)nc2n1
InChI Key InChIKey=KXAHQWGAPXHFGG-UHFFFAOYSA-N
Data  1 IC50
  Tab Delimited (TSV)   2D SDfile   Computed 3D by Vconf -m prep SDfile
Find this compound or compounds like it in BindingDB:
Activity Spreadsheet -- Enzyme Inhibition Constant Data from BindingDB
Found 1 hit for monomerid = 50390359
LigandPNGBDBM50390359(CHEMBL2070928)
Affinity DataIC50:  458nM. Assay description: Inhibition of PDE8B expressed in Sf9 insect cells
In DepthDetails ArticlePubMed