BDBM50390360 CHEMBL2070929
SMILES Nc1nc(nc2n(Cc3ccc(cc3)C(F)(F)F)nnc12)C1CC1
InChI Key InChIKey=RBTRXPAPDCTPQL-UHFFFAOYSA-N
Data  1 IC50
  Tab Delimited (TSV)   2D SDfile   Computed 3D by Vconf -m prep SDfile
Find this compound or compounds like it in BindingDB:
Activity Spreadsheet -- Enzyme Inhibition Constant Data from BindingDB
Found 1 hit for monomerid = 50390360
LigandPNGBDBM50390360(CHEMBL2070929)
Affinity DataIC50:  78.4nM. Assay description: Inhibition of PDE8B expressed in Sf9 insect cells
In DepthDetails ArticlePubMed