BDBM50390361 CHEMBL2070930
SMILES CCCCN1CC(Cn2nnc3c(N)nc(nc23)C2CC2)OCC1=O
InChI Key InChIKey=TVDDTKOBIXXCAE-UHFFFAOYSA-N
Data  1 IC50
  Tab Delimited (TSV)   2D SDfile   Computed 3D by Vconf -m prep SDfile
Find this compound or compounds like it in BindingDB:
Activity Spreadsheet -- Enzyme Inhibition Constant Data from BindingDB
Found 1 hit for monomerid = 50390361
LigandPNGBDBM50390361(CHEMBL2070930)
Affinity DataIC50:  455nM. Assay description: Inhibition of PDE8B expressed in Sf9 insect cells
In DepthDetails ArticlePubMed