BDBM50390374 CHEMBL2070915
SMILES Cn1cc(CCn2nnc3c(N)nc(nc23)C2CC2)cn1
InChI Key InChIKey=CEWAOXZCZRNAPF-UHFFFAOYSA-N
Data  1 IC50
  Tab Delimited (TSV)   2D SDfile   Computed 3D by Vconf -m prep SDfile
Find this compound or compounds like it in BindingDB:
Activity Spreadsheet -- Enzyme Inhibition Constant Data from BindingDB
Found 1 hit for monomerid = 50390374
LigandPNGBDBM50390374(CHEMBL2070915)
Affinity DataIC50:  551nM. Assay description: Inhibition of PDE8B expressed in Sf9 insect cells
In DepthDetails ArticlePubMed