BDBM50390980 CHEMBL2074595
SMILES Nc1ncnc2n(ccc12)[C@H]1C[C@H](O)[C@@H](CO)O1
InChI Key InChIKey=NIJSNUNKSPLDTO-DJLDLDEBSA-N
Data  1 KI
  Tab Delimited (TSV)   2D SDfile   Computed 3D by Vconf -m prep SDfile
Find this compound or compounds like it in BindingDB:
Activity Spreadsheet -- Enzyme Inhibition Constant Data from BindingDB
Found 1 hit for monomerid = 50390980
TargetSolute carrier family 22 member 1(RAT)
The University Of Texas M.D. Anderson Cancer Center
Curated by ChEMBL
LigandPNGBDBM50390980(CHEMBL2074595)
Affinity DataKi:  1.90E+4nM. Assay description: TP_TRANSPORTER: inhibition of TEA uptake in Xenopus laevis oocytes
In DepthDetails ArticlePubMed