BDBM50391371 CHEMBL2148001
SMILES CCc1ccccc1-c1c[nH]nn1
InChI Key InChIKey=AYTAFMWWGJROJC-UHFFFAOYSA-N
Data  5 IC50
  Tab Delimited (TSV)   2D SDfile   Computed 3D by Vconf -m prep SDfile
Find this compound or compounds like it in BindingDB:
Activity Spreadsheet -- Enzyme Inhibition Constant Data from BindingDB
Found 5 hits for monomerid = 50391371
TargetIndoleamine 2,3-dioxygenase 1(Mus musculus)
Ludwig Center For Cancer Research Of The University Of Lausanne
Curated by ChEMBL
LigandPNGBDBM50391371(CHEMBL2148001)
Affinity DataIC50:  1.30E+4nM. Assay description: Inhibition of mouse IDO1 in P815 clone 6 cells by HPLC analysis
In DepthDetails ArticlePubMed
TargetIndoleamine 2,3-dioxygenase 1(Homo sapiens (Human))
Ludwig Center For Cancer Research Of The University Of Lausanne
Curated by ChEMBL
LigandPNGBDBM50391371(CHEMBL2148001)
Affinity DataIC50: >1.00E+5nM. Assay description: Inhibition of human IDO1 transfected in mouse P815B clone-6 cells by HPLC analysis
In DepthDetails ArticlePubMed
TargetIndoleamine 2,3-dioxygenase 1(Homo sapiens (Human))
Ludwig Center For Cancer Research Of The University Of Lausanne
Curated by ChEMBL
LigandPNGBDBM50391371(CHEMBL2148001)
Affinity DataIC50:  2.30E+5nMpH: 6.5Assay Description:Inhibition of human recombinant N-terminal His-tagged IDO1 (Ala2 to Gly403) overexpressed in Escherichia coli BL21 at pH 6.5 after 60 mins by HPLC an...
In DepthDetails ArticlePubMed
TargetTryptophan 2,3-dioxygenase(Homo sapiens (Human))
Ludwig Center For Cancer Research Of The University Of Lausanne
Curated by ChEMBL
LigandPNGBDBM50391371(CHEMBL2148001)
Affinity DataIC50: >1.00E+5nM. Assay description: Inhibition of human TDO transfected in mouse P815B clone 19 cells by HPLC analysis
In DepthDetails ArticlePubMed
TargetTryptophan 2,3-dioxygenase(Mus musculus)
Ludwig Center For Cancer Research Of The University Of Lausanne
Curated by ChEMBL
LigandPNGBDBM50391371(CHEMBL2148001)
Affinity DataIC50: >1.00E+5nM. Assay description: Inhibition of mouse TDO in P815 clone 12 cells by HPLC analysis
In DepthDetails ArticlePubMed