BDBM50391705 CHEMBL2146812
SMILES CN1CCC[C@@H]1Cn1nc(Cc2ccc(Cl)cc2)c2nccnc2c1=O
InChI Key InChIKey=DGZLHXBKGBELTQ-OAHLLOKOSA-N
Data  4 KI  1 IC50
  Tab Delimited (TSV)   2D SDfile   Computed 3D by Vconf -m prep SDfile
Find this compound or compounds like it in BindingDB:
Activity Spreadsheet -- Enzyme Inhibition Constant Data from BindingDB
Found 5 hits for monomerid = 50391705
TargetHistamine H1 receptor(Homo sapiens (Human))
Glaxosmithkline
Curated by ChEMBL
LigandPNGBDBM50391705(CHEMBL2146812)
Affinity DataKi:  1.29nM. Assay description: Antagonist activity at human H1 receptor expressed in CHO cells assessed as inhibition of calcium mobilization by FLIPR assay
In DepthDetails ArticlePubMed
TargetAlpha-1B adrenergic receptor(Homo sapiens (Human))
Glaxosmithkline
Curated by ChEMBL
LigandPNGBDBM50391705(CHEMBL2146812)
Affinity DataKi:  251nM. Assay description: Antagonist activity at human adrenergic alpha1B receptor expressed in rat fibroblasts by by plate-based calcium imaging
In DepthDetails ArticlePubMed
TargetAlpha-1A adrenergic receptor(Homo sapiens (Human))
Glaxosmithkline
Curated by ChEMBL
LigandPNGBDBM50391705(CHEMBL2146812)
Affinity DataKi:  398nM. Assay description: Antagonist activity at human adrenergic alpha1A receptor expressed in rat fibroblasts by by plate-based calcium imaging
In DepthDetails ArticlePubMed
TargetHistamine H3 receptor(Homo sapiens (Human))
Glaxosmithkline
Curated by ChEMBL
LigandPNGBDBM50391705(CHEMBL2146812)
Affinity DataKi:  631nM. Assay description: Antagonist activity at human H3 receptor expressed in CHO cells assessed as inhibition of histamine-induced GTPgamma[S] binding by scintillation prox...
In DepthDetails ArticlePubMed
TargetPotassium voltage-gated channel subfamily H member 2(Homo sapiens (Human))
Glaxosmithkline
Curated by ChEMBL
LigandPNGBDBM50391705(CHEMBL2146812)
Affinity DataIC50:  1.26E+3nM. Assay description: Displacement of [3H]dofetilide from human ERG
In DepthDetails ArticlePubMed