BDBM50392512 CHEMBL2152165
SMILES FC(F)C(F)(F)Oc1cc(F)cc(c1)[C@](Cc1ccccc1)(NC(=O)NC1CCCC1)c1ccc(Cl)cn1
InChI Key InChIKey=DLEGYAJVPJEXJD-SANMLTNESA-N
Data  10 IC50
  Tab Delimited (TSV)   2D SDfile   Computed 3D by Vconf -m prep SDfile
Find this compound or compounds like it in BindingDB:
Activity Spreadsheet -- Enzyme Inhibition Constant Data from BindingDB
Found 10 hits for monomerid = 50392512
TargetCholesteryl ester transfer protein(Homo sapiens (Human))
Bristol-Myers Squibb
Curated by ChEMBL
LigandPNGBDBM50392512(CHEMBL2152165)
Affinity DataIC50:  630nM. Assay description: Inhibition of CETP-mediated [3H]cholesteryl ester transfer activity in human plasma after 2.5 hrs by scintillation counter
In DepthDetails ArticlePubMed
TargetCholesteryl ester transfer protein(Homo sapiens (Human))
Bristol-Myers Squibb
Curated by ChEMBL
LigandPNGBDBM50392512(CHEMBL2152165)
Affinity DataIC50:  6.90nM. Assay description: Inhibition of human recombinant CETP-mediated [3H]cholesteryl ester transfer from HDL to biotinylated LDL by scintillation proximity assay
In DepthDetails ArticlePubMed
TargetCholesteryl ester transfer protein(Homo sapiens (Human))
Bristol-Myers Squibb
Curated by ChEMBL
LigandPNGBDBM50392512(CHEMBL2152165)
Affinity DataIC50:  630nM. Assay description: Inhibition of CETP in human whole plasma using [3H]-CE/HDL after 10 mins
In DepthDetails ArticlePubMed
TargetCholesteryl ester transfer protein(Homo sapiens (Human))
Bristol-Myers Squibb
Curated by ChEMBL
LigandPNGBDBM50392512(CHEMBL2152165)
Affinity DataIC50:  7nM. Assay description: Inhibition of human recombinant CETP using [3H]-CE/HDL by scintillation proximity assay
In DepthDetails ArticlePubMed
TargetCholesteryl ester transfer protein(Homo sapiens (Human))
Bristol-Myers Squibb
Curated by ChEMBL
LigandPNGBDBM50392512(CHEMBL2152165)
Affinity DataIC50:  630nM. Assay description: Inhibition of CETP in human plasma using [3H]cholesterol ester/HDL as substrate after 10 mins by scintillation counting
In DepthDetails ArticlePubMed
TargetCytochrome P450 2C19(Homo sapiens (Human))
Bristol-Myers Squibb
Curated by ChEMBL
LigandPNGBDBM50392512(CHEMBL2152165)
Affinity DataIC50:  1.70E+4nM. Assay description: Inhibition of CYP2C19 (unknown origin)
In DepthDetails ArticlePubMed
TargetCytochrome P450 2C9(Homo sapiens (Human))
Bristol-Myers Squibb
Curated by ChEMBL
LigandPNGBDBM50392512(CHEMBL2152165)
Affinity DataIC50:  4.40E+3nM. Assay description: Inhibition of CYP2C9 (unknown origin)
In DepthDetails ArticlePubMed
TargetCytochrome P450 1A2(Homo sapiens (Human))
Bristol-Myers Squibb
Curated by ChEMBL
LigandPNGBDBM50392512(CHEMBL2152165)
Affinity DataIC50:  4.00E+4nM. Assay description: Inhibition of CYP1A2 (unknown origin)
In DepthDetails ArticlePubMed
TargetCholesteryl ester transfer protein(Homo sapiens (Human))
Bristol-Myers Squibb
Curated by ChEMBL
LigandPNGBDBM50392512(CHEMBL2152165)
Affinity DataIC50:  6nM. Assay description: Inhibition of human recombinant CETP using [3H]cholesterol ester/HDL as substrate by scintillation proximity assay
In DepthDetails ArticlePubMed
TargetCytochrome P450 2D6(Homo sapiens (Human))
Bristol-Myers Squibb
Curated by ChEMBL
LigandPNGBDBM50392512(CHEMBL2152165)
Affinity DataIC50:  1.50E+4nM. Assay description: Inhibition of CYP2D6 (unknown origin)
In DepthDetails ArticlePubMed