BDBM50393212 CHEMBL2153739
SMILES NC(=O)[C@H](Cc1c[nH]c2ccccc12)NC(=O)[C@@H](CP(O)(=O)[C@H](Cc1ccccc1)NC(=O)OCc1ccccc1)c1cc(no1)-c1cccc(Oc2ccccc2)c1
InChI Key InChIKey=SGHHKDAEMQQYOU-CEURZZNXSA-N
Data  2 KI
  Tab Delimited (TSV)   2D SDfile   Computed 3D by Vconf -m prep SDfile
Find this compound or compounds like it in BindingDB:
Activity Spreadsheet -- Enzyme Inhibition Constant Data from BindingDB
Found 2 hits for monomerid = 50393212
TargetCollagenase 3(Homo sapiens (Human))
Wroclaw University Of Technology
Curated by ChEMBL
LigandPNGBDBM50393212(CHEMBL2153739)
Affinity DataKi:  28nM. Assay description: Inhibition of MMP-13
In DepthDetails ArticlePubMed
TargetMatrix metalloproteinase-14(Homo sapiens (Human))
Wroclaw University Of Technology
Curated by ChEMBL
LigandPNGBDBM50393212(CHEMBL2153739)
Affinity DataKi:  5.10E+3nM. Assay description: Inhibition of MMP-14
In DepthDetails ArticlePubMed