BDBM50394018 CHEMBL2158471
SMILES CCCSc1nc(ncc1C(=O)N[C@H]1C2CC3CC1C[C@](O)(C3)C2)N1CCOCC1
InChI Key InChIKey=ALDSAFDPVLSGCJ-UEYBDPOWSA-N
Data  2 IC50
  Tab Delimited (TSV)   2D SDfile   Computed 3D by Vconf -m prep SDfile
Find this compound or compounds like it in BindingDB:
Activity Spreadsheet -- Enzyme Inhibition Constant Data from BindingDB
Found 2 hits for monomerid = 50394018
Target11-beta-hydroxysteroid dehydrogenase 1(Homo sapiens (Human))
Astrazeneca
Curated by ChEMBL
LigandPNGBDBM50394018(CHEMBL2158471)
Affinity DataIC50:  11nM. Assay description: Inhibition of human 11betaHSD1 by HTRF assay
In DepthDetails ArticlePubMed
Target11-beta-hydroxysteroid dehydrogenase 1(Mus musculus (mouse))
Astrazeneca
Curated by ChEMBL
LigandPNGBDBM50394018(CHEMBL2158471)
Affinity DataIC50:  191nM. Assay description: Inhibition of mouse 11betaHSD1 by HTRF assay
In DepthDetails ArticlePubMed