BDBM50394657 CHEMBL270067
SMILES C[C@H](CCC(O)=O)[C@H]1CC[C@H]2[C@@H]3CC[C@@H]4C[C@@H](O)CC[C@]4(C)[C@H]3CC[C@]12C
InChI Key InChIKey=SMEROWZSTRWXGI-WFVDQZAMSA-N
Data  1 KI  2 IC50
  Tab Delimited (TSV)   2D SDfile   Computed 3D by Vconf -m prep SDfile
Find this compound or compounds like it in BindingDB:
Activity Spreadsheet -- Enzyme Inhibition Constant Data from BindingDB
Found 3 hits for monomerid = 50394657
TargetAldo-keto reductase family 1 member B10(Homo sapiens (Human))
Gifu Pharmaceutical University
Curated by ChEMBL
LigandPNGBDBM50394657(CHEMBL270067)
Affinity DataKi:  15nM. Assay description: Inhibition of reductase activity of N-terminal 6His-tagged human AKR1B10 expressed in Escherichia coli BL21(DE3) assessed as pyridine-3-aldehyde redu...
In DepthDetails ArticlePubMed
TargetAldo-keto reductase family 1 member B10(Homo sapiens (Human))
Gifu Pharmaceutical University
Curated by ChEMBL
LigandPNGBDBM50394657(CHEMBL270067)
Affinity DataIC50:  27nM. Assay description: Inhibition of recombinant human intestinal N-terminal 6-His-tagged AKR1B10 expressed in Escherichia coli BL21 (DE3) pLysS cells using pyridine-3-alde...
In DepthDetails ArticlePubMed
TargetAldo-keto reductase family 1 member B1(Homo sapiens (Human))
Gifu Pharmaceutical University
Curated by ChEMBL
LigandPNGBDBM50394657(CHEMBL270067)
Affinity DataIC50:  6.90E+3nM. Assay description: Inhibition of recombinant human AKR1B1 using pyridine-3-aldehyde as substrate by fluorescence assay
In DepthDetails ArticlePubMed