BDBM50394928 CHEMBL2165674
SMILES COc1ccccc1N1CCN(C)CC1
InChI Key InChIKey=ZYXMVSPWOATGIW-UHFFFAOYSA-N
Data  2 KI
  Tab Delimited (TSV)   2D SDfile   Computed 3D by Vconf -m prep SDfile
Find this compound or compounds like it in BindingDB:
Activity Spreadsheet -- Enzyme Inhibition Constant Data from BindingDB
Found 2 hits for monomerid = 50394928
TargetD(2) dopamine receptor(Homo sapiens (Human))
National Institute On Drug Abuse-Intramural Research Program
Curated by ChEMBL
LigandPNGBDBM50394928(CHEMBL2165674)
Affinity DataKi:  265nM. Assay description: Displacement of [125I]IABN from human D2L receptor expressed in HEK293 cells after 60 mins by gamma counting analysis
In DepthDetails ArticlePubMed
TargetD(3) dopamine receptor(Homo sapiens (Human))
National Institute On Drug Abuse-Intramural Research Program
Curated by ChEMBL
LigandPNGBDBM50394928(CHEMBL2165674)
Affinity DataKi:  590nM. Assay description: Displacement of [125I]IABN from human D3 receptor expressed in HEK293 cells after 60 mins by gamma counting analysis
In DepthDetails ArticlePubMed