BDBM503951 US11034691, CYM generic formula 52749
SMILES Fc1cc(ccc1Cl)[C@H](Nc1nc2ccc(Cl)cc2o1)c1ccc(Cl)cc1F
InChI Key InChIKey=QOYPZFURCHEYHM-IBGZPJMESA-N
Data  2 IC50
  Tab Delimited (TSV)   2D SDfile   Computed 3D by Vconf -m prep SDfile
Find this compound or compounds like it in BindingDB:
Activity Spreadsheet -- Enzyme Inhibition Constant Data from BindingDB
Found 2 hits for monomerid = 503951
TargetSphingosine 1-phosphate receptor 3(Homo sapiens (Human))
The Scripps Research Institute
US Patent
LigandPNGBDBM503951(US11034691, CYM generic formula 52749)
Affinity DataIC50:  19nM. Assay description: Ligand competition binding was used.
Ligand InfoPC cidPC sid
In DepthDetails US Patent
TargetSphingosine 1-phosphate receptor 1(Homo sapiens (Human))
The Scripps Research Institute
US Patent
LigandPNGBDBM503951(US11034691, CYM generic formula 52749)
Affinity DataIC50:  199nM. Assay description: Ligand competition binding was used.
Ligand InfoPC cidPC sid
In DepthDetails US Patent