BDBM50395895 CHEMBL2164194
SMILES CC(CCc1cc(no1)-c1cccc(F)c1F)(C(=O)NO)S(C)(=O)=O
InChI Key InChIKey=UXZJOVOZTJESLL-UHFFFAOYSA-N
Data  1 IC50
  Tab Delimited (TSV)   2D SDfile   Computed 3D by Vconf -m prep SDfile
Find this compound or compounds like it in BindingDB:
Activity Spreadsheet -- Enzyme Inhibition Constant Data from BindingDB
Found 1 hit for monomerid = 50395895
TargetUDP-3-O-acyl-N-acetylglucosamine deacetylase(Pseudomonas aeruginosa)
Pfizer
Curated by ChEMBL
LigandPNGBDBM50395895(CHEMBL2164194)
Affinity DataIC50:  6.81nM. Assay description: Inhibition of Pseudomonas aeruginosa LpxC
In DepthDetails ArticlePubMed