BDBM503960 (1S,2S)—N-(8-amino-5-chloro-6-(4-methylpyridin-3-yl)-2,7-naphthyridin-3-yl)-2-(1-methyl-1H-pyrazol-4-yl)cyclopropanecarboxamide (Compound 233) and (1R,2R)—N-(8-amino-5-chloro-6-(4-methylpyridin-3-yl)-2,7-naphthyridin-3-yl)-2-(1-methyl-1H-pyrazol-4-yl)cyclopropanecarboxamide ::US11034692, Compound 234
SMILES Cc1ccncc1-c1nc(N)c2cnc(NC(=O)[C@@H]3C[C@H]3c3cnn(C)c3)cc2c1Cl
InChI Key InChIKey=ATXZZRMISMOXBB-DZGCQCFKSA-N
Data  1 KI
  Tab Delimited (TSV)   2D SDfile   Computed 3D by Vconf -m prep SDfile
Find this compound or compounds like it in BindingDB:
Activity Spreadsheet -- Enzyme Inhibition Constant Data from BindingDB
Found 1 hit for monomerid = 503960
TargetMitogen-activated protein kinase kinase kinase kinase 1(Homo sapiens (Human))
Genentech
US Patent
LigandPNGBDBM503960((1S,2S)—N-(8-amino-5-chloro-6-(4-methylpyridi...)
Affinity DataKi:  0.0780nM. Assay description: Lanth: For the binding assay, 4 ul 2×HPK1 and Eu-anti-GST antibody were added to each well of the assay plate using a Multidrop reagent dispenser. Th...
Ligand InfoPC cidPC sid
In DepthDetails US Patent