BDBM50396293 CHEMBL94809
SMILES CCCCCCCCCCCCCCCCS(F)(=O)=O
InChI Key InChIKey=QIVFMUVBIHIZAM-UHFFFAOYSA-N
Data  2 IC50
  Tab Delimited (TSV)   2D SDfile   Computed 3D by Vconf -m prep SDfile
Find this compound or compounds like it in BindingDB:
Activity Spreadsheet -- Enzyme Inhibition Constant Data from BindingDB
Found 2 hits for monomerid = 50396293
TargetFatty-acid amide hydrolase 1 [30-579](Rattus norvegicus (rat))
Universit£
Curated by ChEMBL
LigandPNGBDBM50396293(CHEMBL94809)
Affinity DataIC50:  13nM. Assay description: Inhibition of Sprague-Dawley rat brain FAAH using [14C]anandamide as substrate by liquid scintillation counting method
In DepthDetails ArticlePubMed
TargetFatty-acid amide hydrolase 1 [30-579](Rattus norvegicus (rat))
Universit£
Curated by ChEMBL
LigandPNGBDBM50396293(CHEMBL94809)
Affinity DataIC50:  6.30nM. Assay description: Inhibition of rat histidine tagged FAAH expressed in Escherichia coli by coumarin ester substrate fluorescence assay
In DepthDetails ArticlePubMed