BDBM50396986 CHEMBL2170999
SMILES CCc1ccccc1NC(=O)NCCCSC[C@H]1O[C@H]([C@H](O)[C@@H]1O)n1cnc2c(N)ncnc12
InChI Key InChIKey=ZUAVYNGHCLODQP-QTQZEZTPSA-N
Data  1 KI
  Tab Delimited (TSV)   2D SDfile   Computed 3D by Vconf -m prep SDfile
Find this compound or compounds like it in BindingDB:
Activity Spreadsheet -- Enzyme Inhibition Constant Data from BindingDB
Found 1 hit for monomerid = 50396986
TargetHistone-lysine N-methyltransferase, H3 lysine-79 specific(Homo sapiens (Human))
Baylor College Of Medicine
Curated by ChEMBL
LigandPNGBDBM50396986(CHEMBL2170999)
Affinity DataKi:  690nM. Assay description: Inhibition of human recombinant DOT1L catalytic domain amino acid (1 to 472) using [3H]-SAM after 30 mins by scintillation counter
In DepthDetails ArticlePubMed