BDBM50397018 CHEMBL2171184
SMILES Nc1ncnc2n(cnc12)[C@@H]1O[C@H](CNCC#C)[C@@H](O)[C@H]1O
InChI Key InChIKey=WYZJLWUBEMXBJJ-QYVSTXNMSA-N
Data  1 KI
PDB links: 2 PDB IDs match this monomer.
  Tab Delimited (TSV)   2D SDfile   Computed 3D by Vconf -m prep SDfile
Find this compound or compounds like it in BindingDB:
Activity Spreadsheet -- Enzyme Inhibition Constant Data from BindingDB
Found 1 hit for monomerid = 50397018
TargetHistone-lysine N-methyltransferase, H3 lysine-79 specific(Homo sapiens (Human))
Baylor College Of Medicine
Curated by ChEMBL
LigandPNGBDBM50397018(CHEMBL2171184)
Affinity DataKi: >1.00E+5nM. Assay description: Inhibition of human recombinant DOT1L catalytic domain amino acid (1 to 472) using [3H]-SAM after 30 mins by scintillation counter
In DepthDetails ArticlePubMed