BDBM50397721 CHEMBL2181977
SMILES Cc1ccc(cc1)-c1nc(NC(=O)Nc2ccc(F)cc2)c2nnn(Cc3ccccc3F)c2n1
InChI Key InChIKey=XMKOEROSRMQYPX-UHFFFAOYSA-N
Data  3 KI  1 IC50
  Tab Delimited (TSV)   2D SDfile   Computed 3D by Vconf -m prep SDfile
Find this compound or compounds like it in BindingDB:
Activity Spreadsheet -- Enzyme Inhibition Constant Data from BindingDB
Found 4 hits for monomerid = 50397721
TargetAdenosine receptor A3(Homo sapiens (Human))
Universit£
Curated by ChEMBL
LigandPNGBDBM50397721(CHEMBL2181977)
Affinity DataKi:  6nM. Assay description: Displacement of [125I]I-AB-MECA from human recombinant adenosine A3 receptor expressed in CHO cells after 60 mins by gamma counter
In DepthDetails ArticlePubMed
TargetAdenosine receptor A1(Homo sapiens (Human))
Universit£
Curated by ChEMBL
LigandPNGBDBM50397721(CHEMBL2181977)
Affinity DataKi:  430nM. Assay description: Displacement of [3H]CCPA from human recombinant adenosine A1 receptor expressed in CHO cells after 60 mins by gamma counter
In DepthDetails ArticlePubMed
TargetAdenosine receptor A2a(Homo sapiens (Human))
Universit£
Curated by ChEMBL
LigandPNGBDBM50397721(CHEMBL2181977)
Affinity DataKi:  8.05E+3nM. Assay description: Displacement of [3H]CGS21680 from human recombinant adenosine A2A receptor expressed in CHO cells after 60 mins by gamma counter
In DepthDetails ArticlePubMed
TargetAdenosine receptor A3(Homo sapiens (Human))
Universit£
Curated by ChEMBL
LigandPNGBDBM50397721(CHEMBL2181977)
Affinity DataIC50:  148nM. Assay description: Antagonist activity at human adenosine A3 receptor expressed in CHO cells assessed as blockade of Cl-IB-MECA-mediated inhibition of forskolin-stimula...
In DepthDetails ArticlePubMed