BDBM50398473 CHEMBL2179137
SMILES CCC[C@H](O)[C@H](NC[C@H](Cc1ccccc1)NC(=O)c1cc2N(C)S(=O)(=O)CCn3cc(CC)c(c1)c23)C(=O)NCC(C)C
InChI Key InChIKey=LWOMHNWWEBISDH-NSGJQZOKSA-N
Data  2 KI
  Tab Delimited (TSV)   2D SDfile   Computed 3D by Vconf -m prep SDfile
Find this compound or compounds like it in BindingDB:
Activity Spreadsheet -- Enzyme Inhibition Constant Data from BindingDB
Found 2 hits for monomerid = 50398473
TargetBeta-secretase 1(Homo sapiens (Human))
Purdue University
Curated by ChEMBL
LigandPNGBDBM50398473(CHEMBL2179137)
Affinity DataKi:  0.400nM. Assay description: Inhibition of recombinant BACE1 expressed in Escherichia coli using Arg- Glu(EDANS)-Glu-Val-Asn-Leu-Asp-Ala-Glu-Phe-Lys(Dabcyl)-Arg as substrate by f...
In DepthDetails ArticlePubMed
TargetCathepsin D(Homo sapiens (Human))
Purdue University
Curated by ChEMBL
LigandPNGBDBM50398473(CHEMBL2179137)
Affinity DataKi:  690nM. Assay description: Inhibition of human cathepsin D
In DepthDetails ArticlePubMed