BDBM50398552 CHEMBL2178059
SMILES CC(C(=O)NCc1ccc(nc1N1CCC(Cc2ccc(F)c(F)c2)CC1)C(F)(F)F)c1ccc(NS(C)(=O)=O)c(F)c1
InChI Key InChIKey=QOMZYLYCCSVVAE-UHFFFAOYSA-N
Data  1 KI  1 IC50
  Tab Delimited (TSV)   2D SDfile   Computed 3D by Vconf -m prep SDfile
Find this compound or compounds like it in BindingDB:
Activity Spreadsheet -- Enzyme Inhibition Constant Data from BindingDB
Found 2 hits for monomerid = 50398552
TargetTransient receptor potential cation channel subfamily V member 1(Homo sapiens (Human))
Seoul National University
Curated by ChEMBL
LigandPNGBDBM50398552(CHEMBL2178059)
Affinity DataKi:  0.200nM. Assay description: Antagonist activity at human TRPV1 expressed in CHOK1 cells assessed as inhibition of capsaicin-induced activity by FLIPR assay
In DepthDetails ArticlePubMed
TargetTransient receptor potential cation channel subfamily V member 1(Homo sapiens (Human))
Seoul National University
Curated by ChEMBL
LigandPNGBDBM50398552(CHEMBL2178059)
Affinity DataIC50:  30nM. Assay description: Antagonist activity at human TRPV1 expressed in CHOK1 cells assessed as inhibition of pH-induced activity by FLIPR assay
In DepthDetails ArticlePubMed