BDBM50398731 CHEMBL2179643
SMILES OC(=O)c1cc(cc(c1)[N+]([O-])=O)-c1cccc(COc2ccc3c(c2)sn(C2CCCC2)c3=O)c1
InChI Key InChIKey=PZLYFIUJOKQBFD-UHFFFAOYSA-N
Data  1 EC50
  Tab Delimited (TSV)   2D SDfile   Computed 3D by Vconf -m prep SDfile
Find this compound or compounds like it in BindingDB:
Activity Spreadsheet -- Enzyme Inhibition Constant Data from BindingDB
Found 1 hit for monomerid = 50398731
TargetMetabotropic glutamate receptor 2(Homo sapiens (Human))
Sanford-Burnham Medical Research Institute
Curated by ChEMBL
LigandPNGBDBM50398731(CHEMBL2179643)
Affinity DataEC50:  200nM. Assay description: Positive allosteric modulation activity at rat mGlu2R expressed in HEK293 cells co-expressing GIRK channels by thallium flux assay
In DepthDetails ArticlePubMed