BDBM50398945 CHEMBL2179254
SMILES Cn1c(cc(c1-c1ccc(O)cc1)-c1ccc(O)cc1)-c1ccc(O)cc1Cl
InChI Key InChIKey=FWLMEBQTURCNKG-UHFFFAOYSA-N
Data  1 EC50
  Tab Delimited (TSV)   2D SDfile   Computed 3D by Vconf -m prep SDfile
Find this compound or compounds like it in BindingDB:
Activity Spreadsheet -- Enzyme Inhibition Constant Data from BindingDB
Found 1 hit for monomerid = 50398945
TargetEstrogen receptor(Homo sapiens (Human))
Freie Universit£T Berlin
Curated by ChEMBL
LigandPNGBDBM50398945(CHEMBL2179254)
Affinity DataEC50:  100nM. Assay description: Activation of human ERalpha expressed in human U2-OS cells by luciferase reporter gene assay relative to untreated control
In DepthDetails ArticlePubMed