BDBM50399056 CHEMBL2178849
SMILES COc1cc(C)cc(Oc2cc(C)nc(c2)N2CCOCC2)c1
InChI Key InChIKey=MTVRVVKFPFPSMI-UHFFFAOYSA-N
Data  1 KI
  Tab Delimited (TSV)   2D SDfile   Computed 3D by Vconf -m prep SDfile
Find this compound or compounds like it in BindingDB:
Activity Spreadsheet -- Enzyme Inhibition Constant Data from BindingDB
Found 1 hit for monomerid = 50399056
TargetMacrophage migration inhibitory factor(Plasmodium falciparum)
Yale University
Curated by ChEMBL
LigandPNGBDBM50399056(CHEMBL2178849)
Affinity DataKi:  1.20E+3nM. Assay description: Inhibition of recombinant Plasmodium falciparum MIF expressed in Escherichia coli BL21 (DE3) assessed as ketonization of enol form of 4-HPP substrate...
In DepthDetails ArticlePubMed