BDBM50400149 CHEMBL2179456
SMILES O[C@@]12CC3CC(C1)[C@H](NC(=O)c1cnc(NC4COC4)nc1C1CCCC1)C(C3)C2
InChI Key InChIKey=GKRODCLKLNRCSS-LEODNSDVSA-N
Data  2 IC50
  Tab Delimited (TSV)   2D SDfile   Computed 3D by Vconf -m prep SDfile
Find this compound or compounds like it in BindingDB:
Activity Spreadsheet -- Enzyme Inhibition Constant Data from BindingDB
Found 2 hits for monomerid = 50400149
Target11-beta-hydroxysteroid dehydrogenase 1(Mus musculus (mouse))
Astrazeneca
Curated by ChEMBL
LigandPNGBDBM50400149(CHEMBL2179456)
Affinity DataIC50:  66nM. Assay description: Inhibition of mouse 11beta-HSD1 by HTRF assay
In DepthDetails ArticlePubMed
Target11-beta-hydroxysteroid dehydrogenase 1(Homo sapiens (Human))
Astrazeneca
Curated by ChEMBL
LigandPNGBDBM50400149(CHEMBL2179456)
Affinity DataIC50:  9nM. Assay description: Inhibition of human 11beta-HSD1 by HTRF assay
In DepthDetails ArticlePubMed