BDBM50400755 CHEMBL2203563
SMILES COc1cnc(COc2ccc(F)c(F)c2)cc1-c1cc2c(CCNC2=O)[nH]1
InChI Key InChIKey=GMIKNOQZLHKCFH-UHFFFAOYSA-N
Data  6 IC50
PDB links: 2 PDB IDs match this monomer.
  Tab Delimited (TSV)   2D SDfile   Computed 3D by Vconf -m prep SDfile
Find this compound or compounds like it in BindingDB:
Activity Spreadsheet -- Enzyme Inhibition Constant Data from BindingDB
Found 6 hits for monomerid = 50400755
TargetCasein kinase I isoform gamma-2(Homo sapiens (Human))
TBA
Curated by ChEMBL
LigandPNGBDBM50400755(CHEMBL2203563)
Affinity DataIC50:  5nM. Assay description: Inhibition of CK1-gamma 2 using biotin[long chain]-KKRRRAL{pS}VATLPGL substrate in presence of 32 uM ATP
TargetCasein kinase I isoform gamma-2(Homo sapiens (Human))
TBA
Curated by ChEMBL
LigandPNGBDBM50400755(CHEMBL2203563)
Affinity DataIC50:  254nM. Assay description: Inhibition of CK1-gamma2 in human RKO cell assessed as inhibition of Wnt3a-induced Wnt signaling treated 1 hr prior to Wnt3a ligand addition measured...
TargetCasein kinase I isoform alpha(Homo sapiens (Human))
TBA
Curated by ChEMBL
LigandPNGBDBM50400755(CHEMBL2203563)
Affinity DataIC50:  251nM. Assay description: Inhibition of CK1-alpha using biotin[long chain]-KKRRRAL{pS}VATLPGL substrate in presence of 8 uM ATP
In DepthDetails ArticlePubMed
TargetGlycogen synthase kinase-3 beta(Homo sapiens (Human))
TBA
Curated by ChEMBL
LigandPNGBDBM50400755(CHEMBL2203563)
Affinity DataIC50:  1.08E+4nM. Assay description: Inhibition of GSK3beta
In DepthDetails ArticlePubMed
TargetCasein kinase I isoform delta(Homo sapiens (Human))
TBA
Curated by ChEMBL
LigandPNGBDBM50400755(CHEMBL2203563)
Affinity DataIC50:  40nM. Assay description: Inhibition of CK1-delta using biotin[long chain]-KKRRRAL{pS}VATLPGL substrate in presence of 11 uM ATP
TargetCasein kinase I isoform gamma-2(Homo sapiens (Human))
TBA
Curated by ChEMBL
LigandPNGBDBM50400755(CHEMBL2203563)
Affinity DataIC50:  200nM. Assay description: Inhibition of human CK1-gamma2 in HEK293 cells assessed as inhibition of doxcycline-induced LRP6 phosphorylation after 2 hrs by electrochemiluminesce...