BDBM50400836 CHEMBL219659
SMILES CN(C)C(=O)c1cnc(o1)C(=O)CCCCCCc1ccccc1
InChI Key InChIKey=XWLDAGUABGJRLH-UHFFFAOYSA-N
Data  2 KI  1 IC50
  Tab Delimited (TSV)   2D SDfile   Computed 3D by Vconf -m prep SDfile
Find this compound or compounds like it in BindingDB:
Activity Spreadsheet -- Enzyme Inhibition Constant Data from BindingDB
Found 3 hits for monomerid = 50400836
TargetFatty-acid amide hydrolase 1(Homo sapiens (Human))
Bristol-Myers Squibb Pharmaceutical Research And Development
Curated by ChEMBL
LigandPNGBDBM50400836(CHEMBL219659)
Affinity DataKi:  2nM. Assay description: Inhibition of FAAH
In DepthDetails ArticlePubMed
TargetFatty-acid amide hydrolase 1(Homo sapiens (Human))
Bristol-Myers Squibb Pharmaceutical Research And Development
Curated by ChEMBL
LigandPNGBDBM50400836(CHEMBL219659)
Affinity DataKi:  2nM. Assay description: Inhibition of rat recombinant FAAH expressed in Escherichia coli by [14C]oleamide breakdown
In DepthDetails ArticlePubMed
TargetDiacylglycerol lipase-alpha(Homo sapiens (Human))
Leiden University
Curated by ChEMBL
LigandPNGBDBM50400836(CHEMBL219659)
Affinity DataIC50: <1.00E+4nM. Assay description: Inhibition of full-length human DAGLalpha expressed in HEK293T cell membranes using para-nitrophenylbutyrate by colorimetric assay
In DepthDetails ArticlePubMed