BDBM50400843 CHEMBL2205679
SMILES COc1ccc(cc1)C(=O)Nc1cccnc1NCC1CCN(CC1)c1ccncc1
InChI Key InChIKey=WKBVIYFWUMNAQD-UHFFFAOYSA-N
Data  1 KI
  Tab Delimited (TSV)   2D SDfile   Computed 3D by Vconf -m prep SDfile
Find this compound or compounds like it in BindingDB:
Activity Spreadsheet -- Enzyme Inhibition Constant Data from BindingDB
Found 1 hit for monomerid = 50400843
TargetCoagulation factor X(Homo sapiens (Human))
Bristol-Myers Squibb Pharmaceutical Research And Development
Curated by ChEMBL
LigandPNGBDBM50400843(CHEMBL2205679)
Affinity DataKi:  39nM. Assay description: Inhibition of factor 10a
In DepthDetails ArticlePubMed