BDBM50400857 CHEMBL2204334
SMILES N[C@H](C(O)=O)C12CC(C1)(C2)c1nnn[nH]1
InChI Key InChIKey=XYCORZCGVTXZFU-XOJFDHPMSA-N
Data  1 IC50
  Tab Delimited (TSV)   2D SDfile   Computed 3D by Vconf -m prep SDfile
Find this compound or compounds like it in BindingDB:
Activity Spreadsheet -- Enzyme Inhibition Constant Data from BindingDB
Found 1 hit for monomerid = 50400857
TargetMetabotropic glutamate receptor 1(Homo sapiens (Human))
Bristol-Myers Squibb Pharmaceutical Research And Development
Curated by ChEMBL
LigandPNGBDBM50400857(CHEMBL2204334)
Affinity DataIC50:  6.89E+4nM. Assay description: Inhibition of mGluR1a receptor
In DepthDetails ArticlePubMed