BDBM50401015 CHEMBL1947086
SMILES COC(=O)[C@@H]1[C@H]2CC[C@@H](C[C@@H]1c1ccc(C)cc1)N2C\C=C\CF
InChI Key InChIKey=XZWRXMFAFBSAJC-BFKYMBCJSA-N
Data  1 Kd
  Tab Delimited (TSV)   2D SDfile   Computed 3D by Vconf -m prep SDfile
Find this compound or compounds like it in BindingDB:
Activity Spreadsheet -- Enzyme Inhibition Constant Data from BindingDB
Found 1 hit for monomerid = 50401015
TargetSodium-dependent dopamine transporter(Rattus norvegicus (rat))
Johannes Gutenberg University
Curated by ChEMBL
LigandPNGBDBM50401015(CHEMBL1947086)
Affinity DataKd:  9nM. Assay description: Binding affinity to rat DAT
In DepthDetails ArticlePubMed