BDBM50401237 CHEMBL2206391
SMILES CCc1cccc(CC)c1CC1=NCCN1
InChI Key InChIKey=WYQAIMKBOICTHH-UHFFFAOYSA-N
Data  1 KI
  Tab Delimited (TSV)   2D SDfile   Computed 3D by Vconf -m prep SDfile
Find this compound or compounds like it in BindingDB:
Activity Spreadsheet -- Enzyme Inhibition Constant Data from BindingDB
Found 1 hit for monomerid = 50401237
TargetTrace amine-associated receptor 1(Homo sapiens (Human))
F. Hoffmann-La Roche
Curated by ChEMBL
LigandPNGBDBM50401237(CHEMBL2206391)
Affinity DataKi:  300nM. Assay description: Displacement of (S)-4-(2,4-difluorophenyl-3-tritio) -4,5-dihydro-2-oxazolamine from human TAAR1 receptor expressed in HEK293 cells after 90 mins by b...
In DepthDetails ArticlePubMed