BDBM50402056 CHEMBL2205431
SMILES C[C@@H](Nc1c(Nc2ccnc(Nc3ccc(Cl)cc3)n2)c(=O)c1=O)C(C)(C)C
InChI Key InChIKey=SSAPLLOWEWCVKP-LLVKDONJSA-N
Data  1 KI
  Tab Delimited (TSV)   2D SDfile   Computed 3D by Vconf -m prep SDfile
Find this compound or compounds like it in BindingDB:
Activity Spreadsheet -- Enzyme Inhibition Constant Data from BindingDB
Found 1 hit for monomerid = 50402056
TargetSerine/threonine-protein kinase PLK1(Homo sapiens (Human))
Abbott Laboratories
Curated by ChEMBL
LigandPNGBDBM50402056(CHEMBL2205431)
Affinity DataKi:  272nM. Assay description: Inhibition of PLK1 in human MIAPaCa2 cells after 48 hrs by MTT assay
In DepthDetails ArticlePubMed