BDBM50402184 CHEMBL2208257
SMILES Clc1ccc2N(Cc3ccc(\C=C4\C(=O)Nc5ccccc45)o3)C(=O)C(=O)c2c1
InChI Key InChIKey=GYLBDBWKKBZUEO-MHWRWJLKSA-N
Data  1 IC50
  Tab Delimited (TSV)   2D SDfile   Computed 3D by Vconf -m prep SDfile
Find this compound or compounds like it in BindingDB:
Activity Spreadsheet -- Enzyme Inhibition Constant Data from BindingDB
Found 1 hit for monomerid = 50402184
TargetTyrosine-protein phosphatase non-receptor type 1(Homo sapiens (Human))
East China University Of Science And Technology
Curated by ChEMBL
LigandPNGBDBM50402184(CHEMBL2208257)
Affinity DataIC50:  4.59E+3nM. Assay description: Inhibition of recombinant PTP1B using para-nitrophenylphosphate as substrate by high throughput screening assay
In DepthDetails ArticlePubMed