BDBM50402369 CHEMBL1652555
SMILES Nc1nc2ccccc2[nH]c1=O
InChI Key InChIKey=QBBADXPVZMYLKN-UHFFFAOYSA-N
Data  1 KI
  Tab Delimited (TSV)   2D SDfile   Computed 3D by Vconf -m prep SDfile
Find this compound or compounds like it in BindingDB:
Activity Spreadsheet -- Enzyme Inhibition Constant Data from BindingDB
Found 1 hit for monomerid = 50402369
TargetUrokinase plasminogen activator surface receptor(Homo sapiens (Human))
National Research Center
Curated by ChEMBL
LigandPNGBDBM50402369(CHEMBL1652555)
Affinity DataKi:  20.8nM. Assay description: Binding affinity to uPAR
In DepthDetails ArticlePubMed