BDBM50402800 CHEMBL2208412
SMILES CC(N(c1ccccc1Cl)S(C)(=O)=O)C(=O)Nc1cccc(Cl)c1
InChI Key InChIKey=ZPCRJPDDEZIKRU-UHFFFAOYSA-N
Data  1 EC50
  Tab Delimited (TSV)   2D SDfile   Computed 3D by Vconf -m prep SDfile
Find this compound or compounds like it in BindingDB:
Activity Spreadsheet -- Enzyme Inhibition Constant Data from BindingDB
Found 1 hit for monomerid = 50402800
TargetMetabotropic glutamate receptor 5(Rattus norvegicus (Rat))
Vanderbilt University Medical Center
Curated by ChEMBL
LigandPNGBDBM50402800(CHEMBL2208412)
Affinity DataEC50:  68nM. Assay description: Ago-positive allosteric modulation of rat mGlu5 receptor expressed in HEK293 cells by fluorescence-based calcium flux assay
In DepthDetails ArticlePubMed