BDBM50402831 CHEMBL2204111
SMILES COC(=O)c1c(Cc2ccc(cc2)S(=O)(=O)CCO)c(=O)c2ccc(F)cc2n1-c1ccccc1
InChI Key InChIKey=RWVFVOHUWIBKDI-UHFFFAOYSA-N
Data  2 IC50
PDB links: 1 PDB ID matches this monomer.
  Tab Delimited (TSV)   2D SDfile   Computed 3D by Vconf -m prep SDfile
Find this compound or compounds like it in BindingDB:
Activity Spreadsheet -- Enzyme Inhibition Constant Data from BindingDB
Found 2 hits for monomerid = 50402831
TargetMitogen-activated protein kinase 8(Homo sapiens (Human))
Roche Palo Alto
Curated by ChEMBL
LigandPNGBDBM50402831(CHEMBL2204111)
Affinity DataIC50:  58nM. Assay description: Inhibition of human JNK1 alpha1 using GST-tagged ATF2 as substrate and [gamma33P]ATP incubated for 10 mins prior to substrate addition measured after...
TargetMitogen-activated protein kinase 9(Homo sapiens (Human))
Roche Palo Alto
Curated by ChEMBL
LigandPNGBDBM50402831(CHEMBL2204111)
Affinity DataIC50:  219nM. Assay description: Inhibition of human JNK2 alpha2 using GST-tagged ATF2 as substrate and [gamma33P]ATP incubated for 10 mins prior to substrate addition measured after...