BDBM50403384 CHEMBL17445
SMILES NCc1ccc(cc1)-c1nc(c([nH]1)-c1ccc(F)cc1)-c1ccncc1
InChI Key InChIKey=PVLYSMBPXOBMBW-UHFFFAOYSA-N
Data  1 IC50
  Tab Delimited (TSV)   2D SDfile   Computed 3D by Vconf -m prep SDfile
Find this compound or compounds like it in BindingDB:
Activity Spreadsheet -- Enzyme Inhibition Constant Data from BindingDB
Found 1 hit for monomerid = 50403384
TargetPolyunsaturated fatty acid 5-lipoxygenase(Homo sapiens (Human))
TBA
Curated by ChEMBL
LigandPNGBDBM50403384(CHEMBL17445)
Affinity DataIC50:  50nM. Assay description: Inhibitory activity against interleukin-1(IL-1) synthesis, using intact human monocytes
In DepthDetails Article