BDBM50403508 CHEMBL88207
SMILES C(CNCC1CCc2ccccc2O1)CNc1ccccn1
InChI Key InChIKey=BHFRJLAPJAERKC-UHFFFAOYSA-N
Data  2 IC50
  Tab Delimited (TSV)   2D SDfile   Computed 3D by Vconf -m prep SDfile
Find this compound or compounds like it in BindingDB:
Activity Spreadsheet -- Enzyme Inhibition Constant Data from BindingDB
Found 2 hits for monomerid = 50403508
Target5-hydroxytryptamine receptor 1D(Homo sapiens (Human))
TBA
Curated by ChEMBL
LigandPNGBDBM50403508(CHEMBL88207)
Affinity DataIC50:  5nM. Assay description: Ability to bind to 5-hydroxytryptamine 1D receptor of calf substantia nigra
In DepthDetails Article
Target5-hydroxytryptamine receptor 1A(Homo sapiens (Human))
TBA
Curated by ChEMBL
LigandPNGBDBM50403508(CHEMBL88207)
Affinity DataIC50:  1.30nM. Assay description: Ability to bind to 5-hydroxytryptamine 1A receptor from cloned human expressed in Ha7 cells
In DepthDetails Article