BDBM50403509 CHEMBL89007
SMILES Clc1ccc(NCCCNCC2CCc3ccccc3O2)nn1
InChI Key InChIKey=UOBLDBABGSURQG-UHFFFAOYSA-N
Data  2 IC50
  Tab Delimited (TSV)   2D SDfile   Computed 3D by Vconf -m prep SDfile
Find this compound or compounds like it in BindingDB:
Activity Spreadsheet -- Enzyme Inhibition Constant Data from BindingDB
Found 2 hits for monomerid = 50403509
Target5-hydroxytryptamine receptor 1A(Homo sapiens (Human))
TBA
Curated by ChEMBL
LigandPNGBDBM50403509(CHEMBL89007)
Affinity DataIC50:  0.398nM. Assay description: Ability to bind to 5-hydroxytryptamine 1A receptor from cloned human expressed in Ha7 cells
In DepthDetails Article
Target5-hydroxytryptamine receptor 1D(Homo sapiens (Human))
TBA
Curated by ChEMBL
LigandPNGBDBM50403509(CHEMBL89007)
Affinity DataIC50:  2nM. Assay description: Ability to bind to 5-hydroxytryptamine 1D receptor of calf substantia nigra
In DepthDetails Article