BDBM50403759 CHEMBL428494
SMILES O=C1Nc2cccc3CCCC1(CCCCN1CCN(CC1)c1ccccn1)c23
InChI Key InChIKey=FVUIPWOKUJXHAP-UHFFFAOYSA-N
Data  7 KI
  Tab Delimited (TSV)   2D SDfile   Computed 3D by Vconf -m prep SDfile
Find this compound or compounds like it in BindingDB:
Activity Spreadsheet -- Enzyme Inhibition Constant Data from BindingDB
Found 7 hits for monomerid = 50403759
Target5-hydroxytryptamine receptor 7(Homo sapiens (Human))
Meiji Seika Kaisha
Curated by ChEMBL
LigandPNGBDBM50403759(CHEMBL428494)
Affinity DataKi:  1.90nM. Assay description: Binding affinity to human recombinant 5-hydroxytryptamine 7 receptor in mammalian cells using [3H]5-CT as radioligand
In DepthDetails ArticlePubMed
Target5-hydroxytryptamine receptor 7(Homo sapiens (Human))
Meiji Seika Kaisha
Curated by ChEMBL
LigandPNGBDBM50403759(CHEMBL428494)
Affinity DataKi:  1.90nM. Assay description: Compound was evaluated for its ability to displace [3H]5-CT binding from cloned human 5-hydroxytryptamine 7 receptor expressed in COS-7 cells.
In DepthDetails ArticlePubMed
Target5-hydroxytryptamine receptor 7(Homo sapiens (Human))
Meiji Seika Kaisha
Curated by ChEMBL
LigandPNGBDBM50403759(CHEMBL428494)
Affinity DataKi:  2nM. Assay description: Displacement of [3H]5-CT from human 5HT7 receptor expressed in in COS7 cells incubated for 30 mins by liquid scintillation counting method
In DepthDetails ArticlePubMed
Target5-hydroxytryptamine receptor 7(Homo sapiens (Human))
Meiji Seika Kaisha
Curated by ChEMBL
LigandPNGBDBM50403759(CHEMBL428494)
Affinity DataKi:  2nM. Assay description: Binding affinity towards human recombinant 5-hydroxytryptamine 7 receptor was determined using [3H]5-CT as radioligand
In DepthDetails ArticlePubMed
Target5-hydroxytryptamine receptor 7(Homo sapiens (Human))
Meiji Seika Kaisha
Curated by ChEMBL
LigandPNGBDBM50403759(CHEMBL428494)
Affinity DataKi:  2nM. Assay description: Binding affinity towards human recombinant 5-hydroxytryptamine 7 receptor using [3H]5-CT as radioligand
In DepthDetails ArticlePubMed
TargetSerotonin 2 (5-HT2) receptor(RAT)
Meiji Seika Kaisha
Curated by ChEMBL
LigandPNGBDBM50403759(CHEMBL428494)
Affinity DataKi:  54nM. Assay description: In vitro binding affinity to 5-hydroxytryptamine 2 receptor of rat cerebral cortex membranes using [3H]ketanserin as the radioligand
In DepthDetails ArticlePubMed
TargetSerotonin 2 (5-HT2) receptor(RAT)
Meiji Seika Kaisha
Curated by ChEMBL
LigandPNGBDBM50403759(CHEMBL428494)
Affinity DataKi:  54nM. Assay description: Compound was evaluated for its ability to displace [3H]ketanserin binding from cloned rat cerebral cortex membranes 5-hydroxytryptamine 2 receptor
In DepthDetails ArticlePubMed