BDBM50403769 CHEMBL276255
SMILES C[C@@H](CCN1CCC[C@H](C)C1)N(C)S(=O)(=O)c1cccc2ccccc12
InChI Key InChIKey=XZYWRBPKJXHPIN-ROUUACIJSA-N
Data  1 KI
  Tab Delimited (TSV)   2D SDfile   Computed 3D by Vconf -m prep SDfile
Find this compound or compounds like it in BindingDB:
Activity Spreadsheet -- Enzyme Inhibition Constant Data from BindingDB
Found 1 hit for monomerid = 50403769
Target5-hydroxytryptamine receptor 7(Homo sapiens (Human))
Universidad Complutense
Curated by ChEMBL
LigandPNGBDBM50403769(CHEMBL276255)
Affinity DataKi:  1.00E+4nM. Assay description: Binding affinity towards cloned human 5-hydroxytryptamine 7 receptor in HEK 293 cells
In DepthDetails ArticlePubMed