BDBM50403775 CHEMBL275996
SMILES C[C@H](CCN1CCC(C)CC1)N(C)S(=O)(=O)c1ccc(Cl)c(Cl)c1
InChI Key InChIKey=ZVZBMRUPOUQIJT-CQSZACIVSA-N
Data  1 KI
  Tab Delimited (TSV)   2D SDfile   Computed 3D by Vconf -m prep SDfile
Find this compound or compounds like it in BindingDB:
Activity Spreadsheet -- Enzyme Inhibition Constant Data from BindingDB
Found 1 hit for monomerid = 50403775
Target5-hydroxytryptamine receptor 7(Homo sapiens (Human))
Universidad Complutense
Curated by ChEMBL
LigandPNGBDBM50403775(CHEMBL275996)
Affinity DataKi:  32nM. Assay description: Binding affinity towards cloned human 5-hydroxytryptamine 7 receptor in HEK 293 cells
In DepthDetails ArticlePubMed