BDBM50403778 CHEMBL12933
SMILES O=S1(=O)N(CCCCCN2CCN(CC2)c2ccccc2)c2cccc3cccc1c23
InChI Key InChIKey=ABULGJVJGNYVCV-UHFFFAOYSA-N
Data  3 KI
  Tab Delimited (TSV)   2D SDfile   Computed 3D by Vconf -m prep SDfile
Find this compound or compounds like it in BindingDB:
Activity Spreadsheet -- Enzyme Inhibition Constant Data from BindingDB
Found 3 hits for monomerid = 50403778
Target5-hydroxytryptamine receptor 7(Rattus norvegicus (rat))
Universidad Complutense
Curated by ChEMBL
LigandPNGBDBM50403778(CHEMBL12933)
Affinity DataKi:  200nM. Assay description: Binding affinity against 5-hydroxytryptamine 7 receptor using [3H]-5-CT in rat hypothalamus membranes
In DepthDetails ArticlePubMed
Target5-hydroxytryptamine receptor 7(Homo sapiens (Human))
Cracow University Of Technology
Curated by ChEMBL
LigandPNGBDBM50403778(CHEMBL12933)
Affinity DataKi:  200nM. Assay description: Binding affinity to 5HT7 (unknown origin)
In DepthDetails ArticlePubMed
Target5-hydroxytryptamine receptor 7(Rattus norvegicus (rat))
Universidad Complutense
Curated by ChEMBL
LigandPNGBDBM50403778(CHEMBL12933)
Affinity DataKi:  200nM. Assay description: Binding affinity towards 5-hydroxytryptamine receptor 7 on rat hypothalamus membranes using [3H]5-CT as radioligand.
In DepthDetails ArticlePubMed