BDBM50403783 CHEMBL273890
SMILES O=C1Nc2cccc3CCCC1(CCCCN1CCN(CC1)C1CCCCC1)c23
InChI Key InChIKey=WSHBWAIJJCWATC-UHFFFAOYSA-N
Data  6 KI
  Tab Delimited (TSV)   2D SDfile   Computed 3D by Vconf -m prep SDfile
Find this compound or compounds like it in BindingDB:
Activity Spreadsheet -- Enzyme Inhibition Constant Data from BindingDB
Found 6 hits for monomerid = 50403783
TargetSerotonin 2 (5-HT2) receptor(RAT)
Meiji Seika Kaisha
Curated by ChEMBL
LigandPNGBDBM50403783(CHEMBL273890)
Affinity DataKi: <1.00E+3nM. Assay description: In vitro binding affinity to 5-hydroxytryptamine 2 receptor of rat cerebral cortex membranes using [3H]ketanserin as the radioligand
In DepthDetails ArticlePubMed
TargetSerotonin 2 (5-HT2) receptor(RAT)
Meiji Seika Kaisha
Curated by ChEMBL
LigandPNGBDBM50403783(CHEMBL273890)
Affinity DataKi: <1.00E+3nM. Assay description: Compound was evaluated for its ability to displace [3H]ketanserin binding from cloned rat cerebral cortex membranes 5-hydroxytryptamine 2 receptor
In DepthDetails ArticlePubMed
Target5-hydroxytryptamine receptor 7(Homo sapiens (Human))
Meiji Seika Kaisha
Curated by ChEMBL
LigandPNGBDBM50403783(CHEMBL273890)
Affinity DataKi: <1.00E+3nM. Assay description: Compound was evaluated for its ability to displace [3H]5-CT binding from cloned human 5-hydroxytryptamine 7 receptor expressed in COS-7 cells.
In DepthDetails ArticlePubMed
Target5-hydroxytryptamine receptor 7(Homo sapiens (Human))
Meiji Seika Kaisha
Curated by ChEMBL
LigandPNGBDBM50403783(CHEMBL273890)
Affinity DataKi: <1.00E+3nM. Assay description: Binding affinity to human recombinant 5-hydroxytryptamine 7 receptor in mammalian cells using [3H]5-CT as radioligand
In DepthDetails ArticlePubMed
Target5-hydroxytryptamine receptor 7(Homo sapiens (Human))
Meiji Seika Kaisha
Curated by ChEMBL
LigandPNGBDBM50403783(CHEMBL273890)
Affinity DataKi:  1.00E+4nM. Assay description: Binding affinity towards cloned human 5-hydroxytryptamine 7 receptor in HEK 293 cells
In DepthDetails ArticlePubMed
Target5-hydroxytryptamine receptor 7(Homo sapiens (Human))
Meiji Seika Kaisha
Curated by ChEMBL
LigandPNGBDBM50403783(CHEMBL273890)
Affinity DataKi:  1.00E+5nM. Assay description: Binding affinity towards human recombinant 5-hydroxytryptamine 7 receptor was determined using [3H]5-CT as radioligand
In DepthDetails ArticlePubMed