BDBM50404152 CHEMBL148687
SMILES Cc1cc(NC(=O)c2sc3ccccc3c2Cl)c(cc1Cl)C(=O)Nc1ccc(Cl)cc1
InChI Key InChIKey=YHZVBOFYHUAIBQ-UHFFFAOYSA-N
Data  3 KI
  Tab Delimited (TSV)   2D SDfile   Computed 3D by Vconf -m prep SDfile
Find this compound or compounds like it in BindingDB:
Activity Spreadsheet -- Enzyme Inhibition Constant Data from BindingDB
Found 3 hits for monomerid = 50404152
TargetCoagulation factor X(Homo sapiens (Human))
Berlex Biosciences
Curated by ChEMBL
LigandPNGBDBM50404152(CHEMBL148687)
Affinity DataKi:  11nM. Assay description: Inhibition constant against human factor Xa
In DepthDetails ArticlePubMed
TargetProthrombin(Homo sapiens (Human))
Berlex Biosciences
Curated by ChEMBL
LigandPNGBDBM50404152(CHEMBL148687)
Affinity DataKi: >5.00E+3nM. Assay description: Inhibition constant against human thrombin
In DepthDetails ArticlePubMed
TargetTrypsin(Homo sapiens (Human))
Berlex Biosciences
Curated by ChEMBL
LigandPNGBDBM50404152(CHEMBL148687)
Affinity DataKi: >5.00E+3nM. Assay description: Inhibition constant against bovine trypsin
In DepthDetails ArticlePubMed