BDBM50404641 CHEMBL174563
SMILES COc1ccc(O)c(CCN(C)C)c1
InChI Key InChIKey=QJJXVGKAMLYOCJ-UHFFFAOYSA-N
Data  2 Kd
  Tab Delimited (TSV)   2D SDfile   Computed 3D by Vconf -m prep SDfile
Find this compound or compounds like it in BindingDB:
Activity Spreadsheet -- Enzyme Inhibition Constant Data from BindingDB
Found 2 hits for monomerid = 50404641
Target5-hydroxytryptamine receptor 2B(RAT)
TBA
Curated by ChEMBL
LigandPNGBDBM50404641(CHEMBL174563)
Affinity DataKd:  302nM. Assay description: Antagonistic against 5-hydroxytryptamine 2B receptor
In DepthDetails ArticlePubMed
Target5-hydroxytryptamine receptor 2B(RAT)
TBA
Curated by ChEMBL
LigandPNGBDBM50404641(CHEMBL174563)
Affinity DataKd:  145nM. Assay description: Antagonistic activity against 5-hydroxytryptamine 2B receptor obtained from rat stomach fundus preparation
In DepthDetails ArticlePubMed