BDBM50404643 CHEMBL175272
SMILES COc1ccc(CC(C)N)c(O)c1
InChI Key InChIKey=ARTJBMNMNUEEDA-UHFFFAOYSA-N
Data  1 Kd
  Tab Delimited (TSV)   2D SDfile   Computed 3D by Vconf -m prep SDfile
Find this compound or compounds like it in BindingDB:
Activity Spreadsheet -- Enzyme Inhibition Constant Data from BindingDB
Found 1 hit for monomerid = 50404643
Target5-hydroxytryptamine receptor 2B(RAT)
TBA
Curated by ChEMBL
LigandPNGBDBM50404643(CHEMBL175272)
Affinity DataKd:  2.51E+3nM. Assay description: Antagonistic against 5-hydroxytryptamine 2B receptor
In DepthDetails ArticlePubMed