BDBM50404644 CHEMBL174380
SMILES COc1cc(CC(C)N)c(O)cc1C
InChI Key InChIKey=NIRJHEFWNFTPAN-UHFFFAOYSA-N
Data  2 Kd
  Tab Delimited (TSV)   2D SDfile   Computed 3D by Vconf -m prep SDfile
Find this compound or compounds like it in BindingDB:
Activity Spreadsheet -- Enzyme Inhibition Constant Data from BindingDB
Found 2 hits for monomerid = 50404644
Target5-hydroxytryptamine receptor 2B(RAT)
TBA
Curated by ChEMBL
LigandPNGBDBM50404644(CHEMBL174380)
Affinity DataKd:  36.3nM. Assay description: Antagonistic activity against 5-hydroxytryptamine 2B receptor obtained from rat stomach fundus preparation
In DepthDetails ArticlePubMed
Target5-hydroxytryptamine receptor 2B(RAT)
TBA
Curated by ChEMBL
LigandPNGBDBM50404644(CHEMBL174380)
Affinity DataKd:  76nM. Assay description: Antagonistic against 5-hydroxytryptamine 2B receptor
In DepthDetails ArticlePubMed